Kernel Error Array Type Has Incomplete Element Type

RECOMMENDED: If you have Windows errors then we strongly recommend that you download and run this (Windows) Repair Tool.

Could Not Start Dhcp Client Service Local Computer Error 1053. Limited connectivity, DHCP Client not. msg always appear "Windows could not start the DHCP CLient service on local Comp. Computer Browser • DHCP Client Canadian Parliamentary Review – Although Windows Server 2008 is a great improvement, there are still a few areas that could be enhanced. In particular, it seems a pity that PowerShell

"array type has incomplete element type" compiling 2.4.32 kernel – I need to compile a 2.4.32 version kernel. "array type has incomplete element type" compiling 2.4.32. error: array type has incomplete element type make:.

In our class we are to implement a kernel. (the compiler needs to see the definition of type whos array. C Compile Error: array type has incomplete element.

Twitter introduced an updated privacy policy on Wednesday that has users worried about how their private information is being tracked, stored and used. In the policy, the micro-blogging platform announced its plans to discontinue a.

sbcl This manual is part of the SBCL software system. See the README file for more information. This manual is largely derived from the manual for the CMUCL system.

커널 bzImage 에러 – Ask Ubuntu KR (by Ubuntu Korea Community) – 2016년 2월 17일. 예제 학습용 디렉터리 /project/kernel에 ftp.kernel.org에서 받은 kernel2.4.21.tar. bz2 를 받아서. error: array type has incomplete element type

Nov 5, 2011. It has been also tested with kernel 3.1. The key. /home/debian/rtl2832u/ dvb_frontend.h:313:28: error: array type has incomplete element type

Jun 15, 2016. Upon testing, I found RPMForge have most stable FFMPEG. /usr/include/sys/ stat.h:367: error: array type has incomplete element type

Feb 14, 2017. /git/arm-soc/drivers/crypto/cavium/cpt/cptpf_main.c:18:0: drivers/crypto/cavium/ cpt/cptpf.h:57:20: error: array type has incomplete element type.

include/drm/drmP.h:1103: error: array type has incomplete element type. Creating udev rule for the Guest Additions kernel module. But:.

72-Page Instant Download: Windows 10 Questions & Answers. In this comprehensive guide, our experts answer the most frequently asked Windows 10 questions ranging from.

status: value: description: status_wait_0: 0x0: status_success: status_success: 0x0: status_success: status_wait_1: 0x1: status_wait_1: status_wait_2: 0x2: status_wait_2

I am working on a project that modifies part of the Android OS, and when I tried to implement a new system call to return the status of all the processes, I.

Dongliang Mu de Blog – binutils 2.15 error: array type has incomplete element type. Jun 27, 2017. Debian Stretch 为Linux Kernel 4.9 打补丁,使VMwareWorkstation 正常运行. Oct 23.

But again when I compile I get more errors like below. tables.c:493:. Yes again. 0 is the element in the array, array type has incomplete element type.

The scientists experimentally warmed an array of ponds over seven years by 4-5ºC and studied the impacts on greenhouse gas emissions and rates of metabolism. Changes observed after the first year became "amplified" over a.

Following this comes a type specifier. more elements of the multi-select form field have been selected, and reads them into the @colors array. This array is then processed with a foreach() loop. In the event that no value is selected,

At MakeUseOf, we cover Linux quite a bit as the “alternative. BSD, on the other hand, is usually an entire operating system and not just the kernel. There are multiple BSD operating systems that do have differences among.

Law Payment Error Error Biohd – 8 Error Invalid Procedure Call Or Argument Chr PL/SQL FAQ – Oracle FAQ – Part of the Oracle FAQs, this is a brief but useful list of PL/SQL questions and answers. The U.S. Supreme Court has ruled for a drug company fighting generic competitors in a decision on the proper standard of

See the manual section on the AbstractArray interface for more details on implementing a custom array type. In general, unlike many other technical computing languages, Julia does not expect programs to be written in a vectorized style.

Error Biohd – 8 Error Invalid Procedure Call Or Argument Chr PL/SQL FAQ – Oracle FAQ – Part of the Oracle FAQs, this is a brief but useful list of PL/SQL questions and answers. The U.S. Supreme Court has ruled for a drug company fighting generic competitors in a decision on the proper standard of review in patent infringement.

Such systems genomics approaches to combine multiple data types provide a more comprehensive understanding of complex genotype–phenotype associations. each data type into an intermediate form, such as a graph or a kernel.

RECOMMENDED: Click here to fix Windows errors and improve system performance